Skip navigation.
Home
Your source for Perl tips, howto's, faq and tutorials
( categories: )

Greetings,

I am unable to complete installation of the Apache::SharedMem module on Ubuntu 9.10. I have used the MCPAN script and the manual install with the same results: make install failure. Terminal feedback is included below. All prerequisite modules are installed. I am unable to find any reference to this problem and would appreciate any suggestions.

Rob

root@obewan:~/.cpan/build/Apache-SharedMem-0.09-zdR6vX# make test
PERL_DL_NONLAZY=1 /usr/bin/perl "-MExtUtils::Command::MM" "-e" "test_harness(0, 'blib/lib', 'blib/arch')" t/*.t
t/assign..........ok 1/8invalid project id at /root/.cpan/build/Apache-SharedMem-0.09-zdR6vX/blib/lib/Apache/SharedMem.pm line 1175.
t/assign..........dubious
Test returned status 255 (wstat 65280, 0xff00)
DIED. FAILED tests 2-8
Failed 7/8 tests, 12.50% okay
t/import..........ok
t/smartlock.......ok 1/16invalid project id at /root/.cpan/build/Apache-SharedMem-0.09-zdR6vX/blib/lib/Apache/SharedMem.pm line 1175.
t/smartlock.......dubious
Test returned status 255 (wstat 65280, 0xff00)
DIED. FAILED tests 2-16
Failed 15/16 tests, 6.25% okay
t/timedoutlock....ok 1/8invalid project id at /root/.cpan/build/Apache-SharedMem-0.09-zdR6vX/blib/lib/Apache/SharedMem.pm line 1175.
t/timedoutlock....dubious
Test returned status 255 (wstat 65280, 0xff00)
DIED. FAILED tests 2-8
Failed 7/8 tests, 12.50% okay
t/zdestroy........invalid project id at /root/.cpan/build/Apache-SharedMem-0.09-zdR6vX/blib/lib/Apache/SharedMem.pm line 1175.
t/zdestroy........dubious
Test returned status 255 (wstat 65280, 0xff00)
DIED. FAILED tests 1-3
Failed 3/3 tests, 0.00% okay
Failed Test Stat Wstat Total Fail List of Failed
-------------------------------------------------------------------------------
t/assign.t 255 65280 8 14 2-8
t/smartlock.t 255 65280 16 30 2-16
t/timedoutlock.t 255 65280 8 14 2-8
t/zdestroy.t 255 65280 3 6 1-3
Failed 4/5 test scripts. 32/40 subtests failed.
Files=5, Tests=40, 0 wallclock secs ( 0.25 cusr + 0.07 csys = 0.32 CPU)
Failed 4/5 test programs. 32/40 subtests failed.
make: *** [test_dynamic] Error 255
root@obewan:~/.cpan/build/Apache-SharedMem-0.09-zdR6vX#